Reaction Details
TargetIntegrin alpha-V/beta-3
LigandBDBM50372589
Substrate/Competitorn/a
Meas. Tech.ChEMBL_465295 (CHEMBL933860)
IC50 0.47±n/a nM
Citation Zanardi, FBurreddu, PRassu, GAuzzas, LBattistini, LCurti, CSartori, ANicastro, GMenchi, GCini, NBottoncetti, ABottonocetti, ARaspanti, SCasiraghi, G Discovery of subnanomolar arginine-glycine-aspartate-based alphaVbeta3/alphaVbeta5 integrin binders embedding 4-aminoproline residues. J Med Chem51:1771-82 (2008) 
 
Integrin alpha-V/beta-3
Name:Integrin alpha-V/beta-3
Type:Enzyme
Mol. Mass.:n/a
Description:n/a
Components:This complex has 2 components.
Component 1
Name:Integrin alpha-V
Synonyms:ITAV_HUMAN Integrin alpha-V/alpha-5 VNRA Vitronectin receptor | Vitronectin receptor subunit alpha
Type:PROTEIN
Mol. Mass.:116024.92
Organism:Homo sapiens (Human)
Description:ChEMBL_582336
Residue:1048
Component 2
Name:Integrin beta-3
Synonyms:CD_antigen=CD61 GPIIIa ITGB3 Platelet membrane glycoprotein IIIa
Type:Protein
Mol. Mass.:87038.91
Organism:Homo sapiens (Human)
Description:P05106
Residue:788
BDBM50372589
NameBDBM50372589
Synonyms:CHEMBL411863
TypeSmall organic molecule
Emp. Form.C17H28N8O6
Mol. Mass.440.4542
SMILES[#7]\[#6](-[#7])=[#7]\[#6]-[#6]-[#6]-[#6@@H]-1-[#7]-[#6](=O)-[#6@@H]-2-[#6]-[#6@@H](-[#6]-[#7]-2)-[#7]-[#6](=O)-[#6@H](-[#6]-[#6](-[#8])=O)-[#7]-[#6](=O)-[#6]-[#7]-[#6]-1=O