Reaction Details
TargetSigma non-opioid intracellular receptor 1
LigandBDBM50366613
Substrate/Competitorn/a
Meas. Tech.ChEMBL_465426 (CHEMBL946010)
IC50 15.2±n/a nM
Citation Nahas, RILever, JRLever, SZ Synthesis and structure-activity relationships of N-(3-phenylpropyl)-N'-benzylpiperazines: Potent ligands for sigma1 and sigma2 receptors. Bioorg Med Chem16:755-61 (2008) 
 
Sigma non-opioid intracellular receptor 1
Name:Sigma non-opioid intracellular receptor 1
Type:Protein
Mol. Mass.:25307.17
Organism:Cavia porcellus (Guinea pig)
Description:Q60492
Residue:223
BDBM50366613
NameBDBM50366613
Synonyms:DEXTROMETHORPHAN
TypeSmall organic molecule
Emp. Form.C18H25NO
Mol. Mass.271.3972
SMILESCOc1ccc2C[C@H]3[C@H]4CCCC[C@@]4(CCN3C)c2c1