Reaction Details
TargetCarbonic anhydrase 1
LigandBDBM50372664
Substrate/Competitorn/a
Meas. Tech.ChEMBL_465605 (CHEMBL951055)
Ki 1.6±n/a nM
Citation Wilkinson, BLInnocenti, AVullo, DSupuran, CTPoulsen, SA Inhibition of carbonic anhydrases with glycosyltriazole benzene sulfonamides. J Med Chem51:1945-53 (2008) 
 
Carbonic anhydrase 1
Name:Carbonic anhydrase 1
Type:Enzyme
Mol. Mass.:28873.37
Organism:Homo sapiens (Human)
Description:P00915
Residue:261
BDBM50372664
NameBDBM50372664
Synonyms:CHEMBL273046
TypeSmall organic molecule
Emp. Form.C22H26N4O11S
Mol. Mass.554.527
SMILESCC(=O)OC[C@H]1O[C@@H]([C@@H](OC(C)=O)[C@@H](OC(C)=O)[C@@H]1OC(C)=O)n1cc(nn1)-c1ccc(cc1)S(N)(=O)=O