Reaction Details
TargetCarbonic anhydrase 2
LigandBDBM50372658
Substrate/Competitorn/a
Meas. Tech.ChEMBL_465606 (CHEMBL951056)
Ki 2.3±n/a nM
Citation Wilkinson, BLInnocenti, AVullo, DSupuran, CTPoulsen, SA Inhibition of carbonic anhydrases with glycosyltriazole benzene sulfonamides. J Med Chem51:1945-53 (2008) 
 
Carbonic anhydrase 2
Name:Carbonic anhydrase 2
Type:Enzyme
Mol. Mass.:29250.71
Organism:Homo sapiens (Human)
Description:P00918
Residue:260
BDBM50372658
NameBDBM50372658
Synonyms:CHEMBL409306
TypeSmall organic molecule
Emp. Form.C13H16N4O6S
Mol. Mass.356.354
SMILESNS(=O)(=O)c1ccc(cc1)-c1cn(nn1)[C@H]1OC[C@@H](O)[C@@H](O)[C@@H]1O