Reaction Details
TargetTyrosine-protein kinase Lck
LigandBDBM50372711
Substrate/Competitorn/a
Meas. Tech.ChEMBL_465744 (CHEMBL948988)
IC50 22±n/a nM
Citation Deak, HLNewcomb, JRNunes, JJBoucher, CCheng, ACDiMauro, EFEpstein, LFGallant, PHodous, BLHuang, XLee, JHPatel, VFSchneider, STurci, SMZhu, X N-(3-(phenylcarbamoyl)arylpyrimidine)-5-carboxamides as potent and selective inhibitors of Lck: structure, synthesis and SAR. Bioorg Med Chem Lett18:1172-6 (2008) 
 
Tyrosine-protein kinase Lck
Name:Tyrosine-protein kinase Lck
Type:n/a
Mol. Mass.:57987.83
Organism:Homo sapiens (Human)
Description:P06239
Residue:509
BDBM50372711
NameBDBM50372711
Synonyms:CHEMBL270793
TypeSmall organic molecule
Emp. Form.C27H29F3N6O4
Mol. Mass.558.5522
SMILESCOc1nc(NCCN2CCOCC2)ncc1C(=O)Nc1cc(ccc1C)C(=O)Nc1cccc(c1)C(F)(F)F