Reaction Details
TargetAdenosine receptor A3
LigandBDBM50180197
Substrate/Competitorn/a
Meas. Tech.ChEMBL_465778 (CHEMBL931047)
Ki 0.38±n/a nM
Citation Jeong, LSLee, HWKim, HOTosh, DKPal, SChoi, WJGao, ZGPatel, ARWilliams, WJacobson, KAKim, HD Structure-activity relationships of 2-chloro-N6-substituted-4'-thioadenosine-5'-N,N-dialkyluronamides as human A3 adenosine receptor antagonists. Bioorg Med Chem Lett18:1612-6 (2008) 
 
Adenosine receptor A3
Name:Adenosine receptor A3
Type:G Protein-Coupled Receptor (GPCR)
Mol. Mass.:36197.32
Organism:Homo sapiens (Human)
Description:P0DMS8
Residue:318
BDBM50180197
NameBDBM50180197
Synonyms:(2S,3S,4R,5R)-5-(2-chloro-6-(3-iodobenzylamino)-9H-purin-9-yl)-3,4-dihydroxy-N-methyltetrahydrothiophene-2-carboxamide CHEMBL200732
TypeSmall organic molecule
Emp. Form.C18H18ClIN6O3S
Mol. Mass.560.796
SMILESCNC(=O)[C@H]1S[C@H]([C@H](O)[C@@H]1O)n1cnc2c(NCc3cccc(I)c3)nc(Cl)nc12