Reaction Details
TargetTyrosine-protein kinase ABL1
LigandBDBM50372736
Substrate/Competitorn/a
Meas. Tech.ChEMBL_465787 (CHEMBL948149)
Ki 20±n/a nM
Citation Manetti, FBrullo, CMagnani, MMosci, FChelli, BCrespan, ESchenone, SNaldini, ABruno, OTrincavelli, MLMaga, GCarraro, FMartini, CBondavalli, FBotta, M Structure-based optimization of pyrazolo[3,4-d]pyrimidines as Abl inhibitors and antiproliferative agents toward human leukemia cell lines. J Med Chem51:1252-9 (2008) 
 
Tyrosine-protein kinase ABL1
Name:Tyrosine-protein kinase ABL1
Type:Enzyme
Mol. Mass.:122897.30
Organism:Homo sapiens (Human)
Description:P00519
Residue:1130
BDBM50372736
NameBDBM50372736
Synonyms:CHEMBL270492
TypeSmall organic molecule
Emp. Form.C20H16ClF2N5
Mol. Mass.399.824
SMILESFc1ccc(cc1)C(Cl)Cn1ncc2c(NCc3ccccc3F)ncnc12