Reaction Details
TargetTyrosine-protein kinase ABL1
LigandBDBM50354485
Substrate/Competitorn/a
Meas. Tech.ChEMBL_465787 (CHEMBL948149)
Ki 40±n/a nM
Citation Manetti, FBrullo, CMagnani, MMosci, FChelli, BCrespan, ESchenone, SNaldini, ABruno, OTrincavelli, MLMaga, GCarraro, FMartini, CBondavalli, FBotta, M Structure-based optimization of pyrazolo[3,4-d]pyrimidines as Abl inhibitors and antiproliferative agents toward human leukemia cell lines. J Med Chem51:1252-9 (2008) 
 
Tyrosine-protein kinase ABL1
Name:Tyrosine-protein kinase ABL1
Type:Enzyme
Mol. Mass.:122897.30
Organism:Homo sapiens (Human)
Description:P00519
Residue:1130
BDBM50354485
NameBDBM50354485
Synonyms:CHEMBL412298
TypeSmall organic molecule
Emp. Form.C20H17ClFN5
Mol. Mass.381.834
SMILESFc1cccc(CNc2ncnc3n(CC(Cl)c4ccccc4)ncc23)c1