Reaction Details
TargetFarnesyl pyrophosphate synthase
LigandBDBM50372756
Substrate/Competitorn/a
Meas. Tech.ChEMBL_465861 (CHEMBL951084)
IC50>50000±n/a nM
Citation Peukert, SSun, YZhang, RHurley, BSabio, MShen, XGray, CDzink-Fox, JTao, JCebula, RWattanasin, S Design and structure-activity relationships of potent and selective inhibitors of undecaprenyl pyrophosphate synthase (UPPS): tetramic, tetronic acids and dihydropyridin-2-ones. Bioorg Med Chem Lett18:1840-4 (2008) 
 
Farnesyl pyrophosphate synthase
Name:Farnesyl pyrophosphate synthase
Type:Enzyme
Mol. Mass.:48272.89
Organism:Homo sapiens (Human)
Description:P14324
Residue:419
BDBM50372756
NameBDBM50372756
Synonyms:CHEMBL404337
TypeSmall organic molecule
Emp. Form.C17H11Cl2NO4
Mol. Mass.364.18
SMILESClc1cc(Cl)cc(NC(=O)C2C(=O)OC(C2=O)c2ccccc2)c1