Reaction Details
TargetFarnesyl pyrophosphate synthase
LigandBDBM50372778
Substrate/Competitorn/a
Meas. Tech.ChEMBL_465861 (CHEMBL951084)
IC50>100000±n/a nM
Citation Peukert, SSun, YZhang, RHurley, BSabio, MShen, XGray, CDzink-Fox, JTao, JCebula, RWattanasin, S Design and structure-activity relationships of potent and selective inhibitors of undecaprenyl pyrophosphate synthase (UPPS): tetramic, tetronic acids and dihydropyridin-2-ones. Bioorg Med Chem Lett18:1840-4 (2008) 
 
Farnesyl pyrophosphate synthase
Name:Farnesyl pyrophosphate synthase
Type:Enzyme
Mol. Mass.:48272.89
Organism:Homo sapiens (Human)
Description:P14324
Residue:419
BDBM50372778
NameBDBM50372778
Synonyms:CHEMBL403226
TypeSmall organic molecule
Emp. Form.C24H26N2O3
Mol. Mass.390.4748
SMILESO=C(Nc1ccc(cc1)C1CCCCC1)C1C(=O)NC(Cc2ccccc2)C1=O