Reaction Details
TargetIsoprenyl transferase
LigandBDBM50372762
Substrate/Competitorn/a
Meas. Tech.ChEMBL_465860 (CHEMBL951083)
IC50 160±n/a nM
Citation Peukert, SSun, YZhang, RHurley, BSabio, MShen, XGray, CDzink-Fox, JTao, JCebula, RWattanasin, S Design and structure-activity relationships of potent and selective inhibitors of undecaprenyl pyrophosphate synthase (UPPS): tetramic, tetronic acids and dihydropyridin-2-ones. Bioorg Med Chem Lett18:1840-4 (2008) 
 
Isoprenyl transferase
Name:Isoprenyl transferase
Type:PROTEIN
Mol. Mass.:28705.02
Organism:Streptococcus pneumoniae
Description:ChEMBL_465860
Residue:252
BDBM50372762
NameBDBM50372762
Synonyms:CHEMBL272162
TypeSmall organic molecule
Emp. Form.C25H28N2O3
Mol. Mass.404.5014
SMILESO=C(Nc1ccc(cc1)C1CCCCC1)C1C(=O)NC(CCc2ccccc2)C1=O