Reaction Details
TargetC-C chemokine receptor type 3
LigandBDBM50372845
Substrate/Competitorn/a
Meas. Tech.ChEMBL_465933 (CHEMBL947057)
IC50 0.5±n/a nM
Citation Santella, JBGardner, DSYao, WShi, CReddy, PTebben, AJDeLucca, GVWacker, DAWatson, PSWelch, PKWadman, EADavies, PSolomon, KAGraden, DMYeleswaram, SMandlekar, SKariv, IDecicco, CPKo, SSCarter, PHDuncia, JV From rigid cyclic templates to conformationally stabilized acyclic scaffolds. Part I: the discovery of CCR3 antagonist development candidate BMS-639623 with picomolar inhibition potency against eosinophil chemotaxis. Bioorg Med Chem Lett18:576-85 (2008) 
 
C-C chemokine receptor type 3
Name:C-C chemokine receptor type 3
Type:Enzyme
Mol. Mass.:41053.88
Organism:Homo sapiens (Human)
Description:P51677
Residue:355
BDBM50372845
NameBDBM50372845
Synonyms:CHEMBL404585
TypeSmall organic molecule
Emp. Form.C29H41FN8O
Mol. Mass.536.6872
SMILESCCc1cc(NC(=O)N[C@H](C)C[C@@H](N(C)C)N2CCC[C@@H](Cc3ccc(F)cc3)C2)cc(c1)-c1nnnn1C