Reaction Details
TargetC-C chemokine receptor type 3
LigandBDBM50372850
Substrate/Competitorn/a
Meas. Tech.ChEMBL_465933 (CHEMBL947057)
IC50 1±n/a nM
Citation Santella, JBGardner, DSYao, WShi, CReddy, PTebben, AJDeLucca, GVWacker, DAWatson, PSWelch, PKWadman, EADavies, PSolomon, KAGraden, DMYeleswaram, SMandlekar, SKariv, IDecicco, CPKo, SSCarter, PHDuncia, JV From rigid cyclic templates to conformationally stabilized acyclic scaffolds. Part I: the discovery of CCR3 antagonist development candidate BMS-639623 with picomolar inhibition potency against eosinophil chemotaxis. Bioorg Med Chem Lett18:576-85 (2008) 
 
C-C chemokine receptor type 3
Name:C-C chemokine receptor type 3
Type:Enzyme
Mol. Mass.:41053.88
Organism:Homo sapiens (Human)
Description:P51677
Residue:355
BDBM50372850
NameBDBM50372850
Synonyms:CHEMBL270583
TypeSmall organic molecule
Emp. Form.C26H34FN7O2
Mol. Mass.495.5923
SMILESCC[C@H](C[C@@H](O)N1CCC[C@@H](Cc2ccc(F)cc2)C1)NC(=O)Nc1cccc(c1)-c1nnnn1C