Reaction Details
TargetC-C chemokine receptor type 3
LigandBDBM50372839
Substrate/Competitorn/a
Meas. Tech.ChEMBL_465933 (CHEMBL947057)
IC50 1.8±n/a nM
Citation Santella, JBGardner, DSYao, WShi, CReddy, PTebben, AJDeLucca, GVWacker, DAWatson, PSWelch, PKWadman, EADavies, PSolomon, KAGraden, DMYeleswaram, SMandlekar, SKariv, IDecicco, CPKo, SSCarter, PHDuncia, JV From rigid cyclic templates to conformationally stabilized acyclic scaffolds. Part I: the discovery of CCR3 antagonist development candidate BMS-639623 with picomolar inhibition potency against eosinophil chemotaxis. Bioorg Med Chem Lett18:576-85 (2008) 
 
C-C chemokine receptor type 3
Name:C-C chemokine receptor type 3
Type:Enzyme
Mol. Mass.:41053.88
Organism:Homo sapiens (Human)
Description:P51677
Residue:355
BDBM50372839
NameBDBM50372839
Synonyms:CHEMBL437031
TypeSmall organic molecule
Emp. Form.C27H36FN7O2
Mol. Mass.509.6188
SMILESCCc1cc(NC(=O)N[C@H](C)C[C@@H](O)N2CCC[C@@H](Cc3ccc(F)cc3)C2)cc(c1)-c1nnnn1C