Reaction Details
TargetC-C chemokine receptor type 3
LigandBDBM50372826
Substrate/Competitorn/a
Meas. Tech.ChEMBL_465934 (CHEMBL947058)
IC50 0.05±n/a nM
Citation Santella, JBGardner, DSYao, WShi, CReddy, PTebben, AJDeLucca, GVWacker, DAWatson, PSWelch, PKWadman, EADavies, PSolomon, KAGraden, DMYeleswaram, SMandlekar, SKariv, IDecicco, CPKo, SSCarter, PHDuncia, JV From rigid cyclic templates to conformationally stabilized acyclic scaffolds. Part I: the discovery of CCR3 antagonist development candidate BMS-639623 with picomolar inhibition potency against eosinophil chemotaxis. Bioorg Med Chem Lett18:576-85 (2008) 
 
C-C chemokine receptor type 3
Name:C-C chemokine receptor type 3
Type:Enzyme
Mol. Mass.:41053.88
Organism:Homo sapiens (Human)
Description:P51677
Residue:355
BDBM50372826
NameBDBM50372826
Synonyms:CHEMBL401879
TypeSmall organic molecule
Emp. Form.C29H34FN7O2
Mol. Mass.531.6244
SMILESC[C@H](C[C@@H](O)N1CCC[C@@H](Cc2ccc(F)cc2)C1)NC(=O)Nc1cc(cc(c1)-n1cccn1)-n1cccn1