Reaction Details
TargetC-C chemokine receptor type 3
LigandBDBM50372833
Substrate/Competitorn/a
Meas. Tech.ChEMBL_465934 (CHEMBL947058)
IC50 0.02±n/a nM
Citation Santella, JBGardner, DSYao, WShi, CReddy, PTebben, AJDeLucca, GVWacker, DAWatson, PSWelch, PKWadman, EADavies, PSolomon, KAGraden, DMYeleswaram, SMandlekar, SKariv, IDecicco, CPKo, SSCarter, PHDuncia, JV From rigid cyclic templates to conformationally stabilized acyclic scaffolds. Part I: the discovery of CCR3 antagonist development candidate BMS-639623 with picomolar inhibition potency against eosinophil chemotaxis. Bioorg Med Chem Lett18:576-85 (2008) 
 
C-C chemokine receptor type 3
Name:C-C chemokine receptor type 3
Type:Enzyme
Mol. Mass.:41053.88
Organism:Homo sapiens (Human)
Description:P51677
Residue:355
BDBM50372833
NameBDBM50372833
Synonyms:CHEMBL427728
TypeSmall organic molecule
Emp. Form.C27H36FN7O
Mol. Mass.493.6194
SMILESCCc1cc(NC(=O)N[C@H](C)CCN2CCC[C@@H](Cc3ccc(F)cc3)C2)cc(c1)-c1nnnn1C