Reaction Details
TargetCytochrome P450 2D6
LigandBDBM50372829
Substrate/Competitorn/a
Meas. Tech.ChEMBL_465935 (CHEMBL947059)
IC50 4400±n/a nM
Citation Santella, JBGardner, DSYao, WShi, CReddy, PTebben, AJDeLucca, GVWacker, DAWatson, PSWelch, PKWadman, EADavies, PSolomon, KAGraden, DMYeleswaram, SMandlekar, SKariv, IDecicco, CPKo, SSCarter, PHDuncia, JV From rigid cyclic templates to conformationally stabilized acyclic scaffolds. Part I: the discovery of CCR3 antagonist development candidate BMS-639623 with picomolar inhibition potency against eosinophil chemotaxis. Bioorg Med Chem Lett18:576-85 (2008) 
 
Cytochrome P450 2D6
Name:Cytochrome P450 2D6
Type:Protein
Mol. Mass.:55774.82
Organism:Homo sapiens (Human)
Description:P10635
Residue:497
BDBM50372829
NameBDBM50372829
Synonyms:CHEMBL428071
TypeSmall organic molecule
Emp. Form.C25H30FN7O2
Mol. Mass.479.5498
SMILESC[C@H](CC(=O)N1CCC[C@@H](Cc2ccc(F)cc2)C1)NC(=O)Nc1cccc(c1)-c1nnnn1C