Reaction Details
TargetMetabotropic glutamate receptor 2
LigandBDBM50372868
Substrate/Competitorn/a
Meas. Tech.ChEMBL_465958 (CHEMBL947082)
IC50 20±n/a nM
Citation Woltering, TJAdam, GWichmann, JGoetschi, EKew, JNKnoflach, FMutel, VGatti, S Synthesis and characterization of 8-ethynyl-1,3-dihydro-benzo[b][1,4]diazepin-2-one derivatives: part 2. New potent non-competitive metabotropic glutamate receptor 2/3 antagonists. Bioorg Med Chem Lett18:1091-5 (2008) 
 
Metabotropic glutamate receptor 2
Name:Metabotropic glutamate receptor 2
Type:Enzyme
Mol. Mass.:95584.88
Organism:Homo sapiens (Human)
Description:Q14416
Residue:872
BDBM50372868
NameBDBM50372868
Synonyms:CHEMBL404886
TypeSmall organic molecule
Emp. Form.C25H16FN5O2
Mol. Mass.437.4252
SMILESOc1cc2N=C(CC(=O)Nc2cc1C#Cc1ccc(F)cc1)c1cccc(c1)-n1ccnn1