Reaction Details
TargetGlucocorticoid receptor
LigandBDBM50372952
Substrate/Competitorn/a
Meas. Tech.ChEMBL_466158 (CHEMBL950162)
Ki 2.5±n/a nM
Citation Clark, RDRay, NCWilliams, KBlaney, PWard, SCrackett, PHHurley, CDyke, HJClark, DELockey, PDevos, RWong, MPorres, SSBright, CPJenkins, REBelanoff, J 1H-Pyrazolo[3,4-g]hexahydro-isoquinolines as selective glucocorticoid receptor antagonists with high functional activity. Bioorg Med Chem Lett18:1312-7 (2008) 
 
Glucocorticoid receptor
Name:Glucocorticoid receptor
Type:Enzyme
Mol. Mass.:85656.87
Organism:Homo sapiens (Human)
Description:P04150
Residue:777
BDBM50372952
NameBDBM50372952
Synonyms:CHEMBL271263
TypeSmall organic molecule
Emp. Form.C30H27F2N3
Mol. Mass.467.5523
SMILESFc1ccc(CC23CN(Cc4ccccc4)CCC2=Cc2c(C3)cnn2-c2ccc(F)cc2)cc1