Reaction Details
TargetGlucocorticoid receptor
LigandBDBM50372954
Substrate/Competitorn/a
Meas. Tech.ChEMBL_466158 (CHEMBL950162)
Ki 3±n/a nM
Citation Clark, RDRay, NCWilliams, KBlaney, PWard, SCrackett, PHHurley, CDyke, HJClark, DELockey, PDevos, RWong, MPorres, SSBright, CPJenkins, REBelanoff, J 1H-Pyrazolo[3,4-g]hexahydro-isoquinolines as selective glucocorticoid receptor antagonists with high functional activity. Bioorg Med Chem Lett18:1312-7 (2008) 
 
Glucocorticoid receptor
Name:Glucocorticoid receptor
Type:Enzyme
Mol. Mass.:85656.87
Organism:Homo sapiens (Human)
Description:P04150
Residue:777
BDBM50372954
NameBDBM50372954
Synonyms:CHEMBL403178
TypeSmall organic molecule
Emp. Form.C29H26F2N4O2S
Mol. Mass.532.604
SMILESFc1ccc(CC23CN(CCC2=Cc2c(C3)cnn2-c2ccc(F)cc2)S(=O)(=O)Nc2ccccc2)cc1