Reaction Details
TargetGlucocorticoid receptor
LigandBDBM50372961
Substrate/Competitorn/a
Meas. Tech.ChEMBL_466158 (CHEMBL950162)
Ki 1.5±n/a nM
Citation Clark, RDRay, NCWilliams, KBlaney, PWard, SCrackett, PHHurley, CDyke, HJClark, DELockey, PDevos, RWong, MPorres, SSBright, CPJenkins, REBelanoff, J 1H-Pyrazolo[3,4-g]hexahydro-isoquinolines as selective glucocorticoid receptor antagonists with high functional activity. Bioorg Med Chem Lett18:1312-7 (2008) 
 
Glucocorticoid receptor
Name:Glucocorticoid receptor
Type:Enzyme
Mol. Mass.:85656.87
Organism:Homo sapiens (Human)
Description:P04150
Residue:777
BDBM50372961
NameBDBM50372961
Synonyms:CHEMBL403921
TypeSmall organic molecule
Emp. Form.C30H27F2N3O2S
Mol. Mass.531.616
SMILESCc1ccc(cc1)S(=O)(=O)N1CCC2=Cc3c(CC2(Cc2ccc(F)cc2)C1)cnn3-c1ccc(F)cc1