Reaction Details
TargetGlucocorticoid receptor
LigandBDBM50372966
Substrate/Competitorn/a
Meas. Tech.ChEMBL_466159 (CHEMBL950163)
Ki 1.2±n/a nM
Citation Clark, RDRay, NCWilliams, KBlaney, PWard, SCrackett, PHHurley, CDyke, HJClark, DELockey, PDevos, RWong, MPorres, SSBright, CPJenkins, REBelanoff, J 1H-Pyrazolo[3,4-g]hexahydro-isoquinolines as selective glucocorticoid receptor antagonists with high functional activity. Bioorg Med Chem Lett18:1312-7 (2008) 
 
Glucocorticoid receptor
Name:Glucocorticoid receptor
Type:Enzyme
Mol. Mass.:85656.87
Organism:Homo sapiens (Human)
Description:P04150
Residue:777
BDBM50372966
NameBDBM50372966
Synonyms:CHEMBL270668
TypeSmall organic molecule
Emp. Form.C27H30FN3O4S
Mol. Mass.511.608
SMILESCOCCOC[C@@]12CN(CCC1=Cc1c(C2)cnn1-c1ccc(F)cc1)S(=O)(=O)c1ccc(C)cc1