Reaction Details
TargetGlucocorticoid receptor
LigandBDBM50372965
Substrate/Competitorn/a
Meas. Tech.ChEMBL_466158 (CHEMBL950162)
Ki 0.6±n/a nM
Citation Clark, RDRay, NCWilliams, KBlaney, PWard, SCrackett, PHHurley, CDyke, HJClark, DELockey, PDevos, RWong, MPorres, SSBright, CPJenkins, REBelanoff, J 1H-Pyrazolo[3,4-g]hexahydro-isoquinolines as selective glucocorticoid receptor antagonists with high functional activity. Bioorg Med Chem Lett18:1312-7 (2008) 
 
Glucocorticoid receptor
Name:Glucocorticoid receptor
Type:Enzyme
Mol. Mass.:85656.87
Organism:Homo sapiens (Human)
Description:P04150
Residue:777
BDBM50372965
NameBDBM50372965
Synonyms:CHEMBL442803
TypeSmall organic molecule
Emp. Form.C26H27F2N3O4S
Mol. Mass.515.572
SMILESCOCCOC[C@@]12CN(CCC1=Cc1c(C2)cnn1-c1ccc(F)cc1)S(=O)(=O)c1ccc(F)cc1