Reaction Details
TargetGlucocorticoid receptor
LigandBDBM50372974
Substrate/Competitorn/a
Meas. Tech.ChEMBL_466159 (CHEMBL950163)
Ki 0.6±n/a nM
Citation Clark, RDRay, NCWilliams, KBlaney, PWard, SCrackett, PHHurley, CDyke, HJClark, DELockey, PDevos, RWong, MPorres, SSBright, CPJenkins, REBelanoff, J 1H-Pyrazolo[3,4-g]hexahydro-isoquinolines as selective glucocorticoid receptor antagonists with high functional activity. Bioorg Med Chem Lett18:1312-7 (2008) 
 
Glucocorticoid receptor
Name:Glucocorticoid receptor
Type:Enzyme
Mol. Mass.:85656.87
Organism:Homo sapiens (Human)
Description:P04150
Residue:777
BDBM50372974
NameBDBM50372974
Synonyms:CHEMBL270575
TypeSmall organic molecule
Emp. Form.C30H36FN3O4S
Mol. Mass.553.688
SMILESCOCCOC[C@@]12CN(CCC1=Cc1c(C2)cnn1-c1ccc(F)cc1)S(=O)(=O)c1ccc(cc1)C(C)(C)C