Reaction Details
TargetIntegrin alpha-4/beta-7
LigandBDBM50372992
Substrate/Competitorn/a
Meas. Tech.ChEMBL_466183 (CHEMBL947947)
IC50 230±n/a nM
Citation Gong, YKent Barbay, JKimball, ESSantulli, RJCarolyn Fisher, MDyatkin, ABMiskowski, TAHornby, PJHe, W Synthesis and SAR of pyridazinone-substituted phenylalanine amide alpha4 integrin antagonists. Bioorg Med Chem Lett18:1331-5 (2008) 
 
Integrin alpha-4/beta-7
Name:Integrin alpha-4/beta-7
Type:Protein Complex
Mol. Mass.:n/a
Description:The assay uses stably transfected K562 cells expressing human alpha4beta7 integrin.
Components:This complex has 2 components.
Component 1
Name:Integrin alpha-4
Synonyms:CD49 antigen-like family member D CD49d antigen ITA4_HUMAN Integrin alpha-4 Integrin alpha-IV VLA-4 integrin alpha 4 precursor | integrin alpha-4 precursor
Type:Membrane Protein
Mol. Mass.:114897.35
Organism:Homo sapiens (Human)
Description:P13612
Residue:1032
Component 2
Name:Integrin beta-7
Synonyms:ITB7_HUMAN Integrin alpha-4/beta-7 Integrin beta7
Type:Membrane Protein
Mol. Mass.:86893.88
Organism:Homo sapiens (Human)
Description:P26010
Residue:798
BDBM50372992
NameBDBM50372992
Synonyms:CHEMBL256639
TypeSmall organic molecule
Emp. Form.C22H21Cl2N3O4
Mol. Mass.462.326
SMILESCOc1cnn(C)c(=O)c1-c1ccc(C[C@@H](CO)NC(=O)c2c(Cl)cccc2Cl)cc1