Reaction Details
TargetIntegrin alpha-4/beta-1
LigandBDBM50372994
Substrate/Competitorn/a
Meas. Tech.ChEMBL_466182 (CHEMBL947946)
IC50 350±n/a nM
Citation Gong, YKent Barbay, JKimball, ESSantulli, RJCarolyn Fisher, MDyatkin, ABMiskowski, TAHornby, PJHe, W Synthesis and SAR of pyridazinone-substituted phenylalanine amide alpha4 integrin antagonists. Bioorg Med Chem Lett18:1331-5 (2008) 
 
Integrin alpha-4/beta-1
Name:Integrin alpha-4/beta-1
Type:n/a
Mol. Mass.:n/a
Description:ASSAY_ID of EBI is 88912
Components:This complex has 2 components.
Component 1
Name:Integrin beta-1
Synonyms:CD_antigen=CD29 Fibronectin receptor beta GPIIA ITGB1 MDF2 | MSK12
Type:Enzyme
Mol. Mass.:88400.38
Organism:Homo sapiens (Human)
Description:P05556
Residue:798
Component 2
Name:Integrin alpha-4
Synonyms:CD49 antigen-like family member D CD49d antigen ITA4_HUMAN Integrin alpha-4 Integrin alpha-IV VLA-4 integrin alpha 4 precursor | integrin alpha-4 precursor
Type:Membrane Protein
Mol. Mass.:114897.35
Organism:Homo sapiens (Human)
Description:P13612
Residue:1032
BDBM50372994
NameBDBM50372994
Synonyms:CHEMBL270407
TypeSmall organic molecule
Emp. Form.C22H19Cl2N3O4S
Mol. Mass.492.375
SMILESCOc1cnn(C)c(=O)c1-c1ccc(C[C@H](NC(=S)c2c(Cl)cccc2Cl)C(O)=O)cc1