Reaction Details
TargetSodium-dependent dopamine transporter
LigandBDBM50373029
Substrate/Competitorn/a
Meas. Tech.ChEMBL_466324 (CHEMBL947041)
Ki>3000±n/a nM
Citation Zeng, FJarkas, NStehouwer, JSVoll, RJOwens, MJKilts, CDNemeroff, CBGoodman, MM Synthesis, in vitro characterization, and radiolabeling of reboxetine analogs as potential PET radioligands for imaging the norepinephrine transporter. Bioorg Med Chem16:783-93 (2008) 
 
Sodium-dependent dopamine transporter
Name:Sodium-dependent dopamine transporter
Type:Multi-pass membrane protein
Mol. Mass.:68497.11
Organism:Homo sapiens (Human)
Description:Q01959
Residue:620
BDBM50373029
NameBDBM50373029
Synonyms:CHEMBL272002
TypeSmall organic molecule
Emp. Form.C19H21NO4
Mol. Mass.327.3743
SMILESCOC(=O)c1ccccc1O[C@H]([C@@H]1CNCCO1)c1ccccc1