Reaction Details
TargetSodium-dependent serotonin transporter
LigandBDBM50373028
Substrate/Competitorn/a
Meas. Tech.ChEMBL_466323 (CHEMBL947040)
Ki 121±n/a nM
Citation Zeng, FJarkas, NStehouwer, JSVoll, RJOwens, MJKilts, CDNemeroff, CBGoodman, MM Synthesis, in vitro characterization, and radiolabeling of reboxetine analogs as potential PET radioligands for imaging the norepinephrine transporter. Bioorg Med Chem16:783-93 (2008) 
 
Sodium-dependent serotonin transporter
Name:Sodium-dependent serotonin transporter
Type:Multi-pass membrane protein
Mol. Mass.:70322.51
Organism:Homo sapiens (Human)
Description:P31645
Residue:630
BDBM50373028
NameBDBM50373028
Synonyms:CHEMBL411262
TypeSmall organic molecule
Emp. Form.C20H24FNO2S
Mol. Mass.361.473
SMILESFCCCOc1ccccc1S[C@H]([C@@H]1CNCCO1)c1ccccc1