Reaction Details
TargetTranscriptional activator protein LuxR
LigandBDBM50373055
Substrate/Competitorn/a
Meas. Tech.ChEMBL_466368 (CHEMBL932480)
IC50 5000±n/a nM
Citation Frezza, MSoulère, LReverchon, SGuiliani, NJerez, CQueneau, YDoutheau, A Synthetic homoserine lactone-derived sulfonylureas as inhibitors of Vibrio fischeri quorum sensing regulator. Bioorg Med Chem16:3550-6 (2008) 
 
Transcriptional activator protein LuxR
Name:Transcriptional activator protein LuxR
Type:PROTEIN
Mol. Mass.:28563.86
Organism:Vibrio fischeri
Description:ChEMBL_831639
Residue:250
BDBM50373055
NameBDBM50373055
Synonyms:CHEMBL408369
TypeSmall organic molecule
Emp. Form.C10H20N2O4S
Mol. Mass.264.342
SMILESCCCCCCNS(=O)(=O)NC1CCOC1=O