Reaction Details
TargetTranscriptional activator protein LuxR
LigandBDBM50373056
Substrate/Competitorn/a
Meas. Tech.ChEMBL_466368 (CHEMBL932480)
IC50 2000±n/a nM
Citation Frezza, MSoulère, LReverchon, SGuiliani, NJerez, CQueneau, YDoutheau, A Synthetic homoserine lactone-derived sulfonylureas as inhibitors of Vibrio fischeri quorum sensing regulator. Bioorg Med Chem16:3550-6 (2008) 
 
Transcriptional activator protein LuxR
Name:Transcriptional activator protein LuxR
Type:PROTEIN
Mol. Mass.:28563.86
Organism:Vibrio fischeri
Description:ChEMBL_831639
Residue:250
BDBM50373056
NameBDBM50373056
Synonyms:CHEMBL261163
TypeSmall organic molecule
Emp. Form.C9H18N2O4S
Mol. Mass.250.315
SMILESCCCCCNS(=O)(=O)NC1CCOC1=O