Reaction Details
TargetD(2) dopamine receptor
LigandBDBM50212239
Substrate/Competitorn/a
Meas. Tech.ChEMBL_466543 (CHEMBL928141)
IC50>10000±n/a nM
Citation Jarvis, MFHonore, PShieh, CCChapman, MJoshi, SZhang, XFKort, MCarroll, WMarron, BAtkinson, RThomas, JLiu, DKrambis, MLiu, YMcGaraughty, SChu, KRoeloffs, RZhong, CMikusa, JPHernandez, GGauvin, DWade, CZhu, CPai, MScanio, MShi, LDrizin, IGregg, RMatulenko, MHakeem, AGross, MJohnson, MMarsh, KWagoner, PKSullivan, JPFaltynek, CRKrafte, DS A-803467, a potent and selective Nav1.8 sodium channel blocker, attenuates neuropathic and inflammatory pain in the rat. Proc Natl Acad Sci U S A104:8520-5 (2007) 
 
D(2) dopamine receptor
Name:D(2) dopamine receptor
Type:Cell-surface receptors
Mol. Mass.:50647.10
Organism:Homo sapiens (Human)
Description:P14416
Residue:443
BDBM50212239
NameBDBM50212239
Synonyms:5-(4-chlorophenyl)-N-(3,5-dimethoxyphenyl)furan-2-carboxamide CHEMBL250699
TypeSmall organic molecule
Emp. Form.C19H16ClNO4
Mol. Mass.357.788
SMILESCOc1cc(NC(=O)c2ccc(o2)-c2ccc(Cl)cc2)cc(OC)c1