Reaction Details
TargetMuscarinic acetylcholine receptor M5
LigandBDBM50212239
Substrate/Competitorn/a
Meas. Tech.ChEMBL_466557 (CHEMBL935649)
IC50>10000±n/a nM
Citation Jarvis, MFHonore, PShieh, CCChapman, MJoshi, SZhang, XFKort, MCarroll, WMarron, BAtkinson, RThomas, JLiu, DKrambis, MLiu, YMcGaraughty, SChu, KRoeloffs, RZhong, CMikusa, JPHernandez, GGauvin, DWade, CZhu, CPai, MScanio, MShi, LDrizin, IGregg, RMatulenko, MHakeem, AGross, MJohnson, MMarsh, KWagoner, PKSullivan, JPFaltynek, CRKrafte, DS A-803467, a potent and selective Nav1.8 sodium channel blocker, attenuates neuropathic and inflammatory pain in the rat. Proc Natl Acad Sci U S A104:8520-5 (2007) 
 
Muscarinic acetylcholine receptor M5
Name:Muscarinic acetylcholine receptor M5
Type:PROTEIN
Mol. Mass.:60102.35
Organism:Homo sapiens (Human)
Description:ChEMBL_1517990
Residue:532
BDBM50212239
NameBDBM50212239
Synonyms:5-(4-chlorophenyl)-N-(3,5-dimethoxyphenyl)furan-2-carboxamide CHEMBL250699
TypeSmall organic molecule
Emp. Form.C19H16ClNO4
Mol. Mass.357.788
SMILESCOc1cc(NC(=O)c2ccc(o2)-c2ccc(Cl)cc2)cc(OC)c1