Reaction Details
TargetFarnesyl pyrophosphate synthase
LigandBDBM50098390
Substrate/Competitorn/a
Meas. Tech.ChEMBL_466619 (CHEMBL924793)
IC50 75.2±n/a nM
Citation Dunford, JEKwaasi, AARogers, MJBarnett, BLEbetino, FHRussell, RGOppermann, UKavanagh, KL Structure-activity relationships among the nitrogen containing bisphosphonates in clinical use and other analogues: time-dependent inhibition of human farnesyl pyrophosphate synthase. J Med Chem51:2187-95 (2008) 
 
Farnesyl pyrophosphate synthase
Name:Farnesyl pyrophosphate synthase
Type:Enzyme
Mol. Mass.:48272.89
Organism:Homo sapiens (Human)
Description:P14324
Residue:419
BDBM50098390
NameBDBM50098390
Synonyms:(3-methylpyridin-2-ylamino)methylenediphosphonic acid 2-{[hydrogen phosphonato(phosphonato)methyl]amino}-3-methylpyridin-1-ium [(3-Methyl-pyridin-2-ylamino)-phosphono-methyl]-phosphonic acid(NE97200) | [(3-methyl-pyridin-2-ylamino)-phosphono-methyl]-phosphonic acid
TypeSmall organic molecule
Emp. Form.C7H12N2O6P2
Mol. Mass.282.1275
SMILESCc1cccnc1NC(P(O)(O)=O)P(O)(O)=O