Reaction Details
TargetFarnesyl pyrophosphate synthase
LigandBDBM50115104
Substrate/Competitorn/a
Meas. Tech.ChEMBL_466619 (CHEMBL924793)
Ki 29.1±n/a nM
Citation Dunford, JEKwaasi, AARogers, MJBarnett, BLEbetino, FHRussell, RGOppermann, UKavanagh, KL Structure-activity relationships among the nitrogen containing bisphosphonates in clinical use and other analogues: time-dependent inhibition of human farnesyl pyrophosphate synthase. J Med Chem51:2187-95 (2008) 
 
Farnesyl pyrophosphate synthase
Name:Farnesyl pyrophosphate synthase
Type:Enzyme
Mol. Mass.:48272.89
Organism:Homo sapiens (Human)
Description:P14324
Residue:419
BDBM50115104
NameBDBM50115104
Synonyms:(pyridin-2-ylamino)methylenediphosphonic acid 2-{[hydrogen phosphonato(phosphonato)methyl]amino}pyridin-1-ium [(2-pyridinylamino)methylene]-1,1-bisphosphonate [Phosphono-(pyridin-2-ylamino)-methyl]-phosphonic acid(NE11807)
TypeSmall organic molecule
Emp. Form.C6H10N2O6P2
Mol. Mass.268.1009
SMILESOP(O)(=O)C(Nc1ccccn1)P(O)(O)=O