Reaction Details
TargetFarnesyl pyrophosphate synthase
LigandBDBM50098378
Substrate/Competitorn/a
Meas. Tech.ChEMBL_466619 (CHEMBL924793)
Ki 59.3±n/a nM
Citation Dunford, JEKwaasi, AARogers, MJBarnett, BLEbetino, FHRussell, RGOppermann, UKavanagh, KL Structure-activity relationships among the nitrogen containing bisphosphonates in clinical use and other analogues: time-dependent inhibition of human farnesyl pyrophosphate synthase. J Med Chem51:2187-95 (2008) 
 
Farnesyl pyrophosphate synthase
Name:Farnesyl pyrophosphate synthase
Type:Enzyme
Mol. Mass.:48272.89
Organism:Homo sapiens (Human)
Description:P14324
Residue:419
BDBM50098378
NameBDBM50098378
Synonyms:(1-Hydroxy-1-phosphono-2-pyridin-2-yl-ethyl)-phosphonic acid 2-(2-Hydroxy-2,2-bis-phosphono-ethyl)-pyridinium CHEMBL434024
TypeSmall organic molecule
Emp. Form.C7H11NO7P2
Mol. Mass.283.1123
SMILESOC(Cc1ccccn1)(P(O)(O)=O)P(O)(O)=O