Reaction Details
TargetFarnesyl pyrophosphate synthase
LigandBDBM50373094
Substrate/Competitorn/a
Meas. Tech.ChEMBL_466620 (CHEMBL924794)
IC50 10.3±n/a nM
Citation Dunford, JEKwaasi, AARogers, MJBarnett, BLEbetino, FHRussell, RGOppermann, UKavanagh, KL Structure-activity relationships among the nitrogen containing bisphosphonates in clinical use and other analogues: time-dependent inhibition of human farnesyl pyrophosphate synthase. J Med Chem51:2187-95 (2008) 
 
Farnesyl pyrophosphate synthase
Name:Farnesyl pyrophosphate synthase
Type:Enzyme
Mol. Mass.:48272.89
Organism:Homo sapiens (Human)
Description:P14324
Residue:419
BDBM50373094
NameBDBM50373094
Synonyms:CHEMBL408608
TypeSmall organic molecule
Emp. Form.C7H16N2O6P2
Mol. Mass.286.1593
SMILESCC1CCCN=C1N=C(P(O)(O)O)P(O)(O)=O