Reaction Details
TargetFarnesyl pyrophosphate synthase
LigandBDBM50373096
Substrate/Competitorn/a
Meas. Tech.ChEMBL_466620 (CHEMBL924794)
IC50 30.4±n/a nM
Citation Dunford, JEKwaasi, AARogers, MJBarnett, BLEbetino, FHRussell, RGOppermann, UKavanagh, KL Structure-activity relationships among the nitrogen containing bisphosphonates in clinical use and other analogues: time-dependent inhibition of human farnesyl pyrophosphate synthase. J Med Chem51:2187-95 (2008) 
 
Farnesyl pyrophosphate synthase
Name:Farnesyl pyrophosphate synthase
Type:Enzyme
Mol. Mass.:48272.89
Organism:Homo sapiens (Human)
Description:P14324
Residue:419
BDBM50373096
NameBDBM50373096
Synonyms:CHEMBL99369 | Piridronic acid
TypeSmall organic molecule
Emp. Form.C7H11NO6P2
Mol. Mass.267.1129
SMILESOP(O)(=O)C(Cc1ccccn1)P(O)(O)=O