Reaction Details
TargetFarnesyl pyrophosphate synthase
LigandBDBM50098382
Substrate/Competitorn/a
Meas. Tech.ChEMBL_466620 (CHEMBL924794)
IC50 337.3±n/a nM
Citation Dunford, JEKwaasi, AARogers, MJBarnett, BLEbetino, FHRussell, RGOppermann, UKavanagh, KL Structure-activity relationships among the nitrogen containing bisphosphonates in clinical use and other analogues: time-dependent inhibition of human farnesyl pyrophosphate synthase. J Med Chem51:2187-95 (2008) 
 
Farnesyl pyrophosphate synthase
Name:Farnesyl pyrophosphate synthase
Type:Enzyme
Mol. Mass.:48272.89
Organism:Homo sapiens (Human)
Description:P14324
Residue:419
BDBM50098382
NameBDBM50098382
Synonyms:(1-Hydroxy-1-phosphono-3-pyridin-3-yl-propyl)-phosphonic acid 1-hydroxy-3-(pyridin-3-yl)propane-1,1-diyldiphosphonic acid 3-(3-hydrogen phosphonato-3-hydroxy-3-phosphonatopropyl)pyridin-1-ium CHEMBL293522
TypeSmall organic molecule
Emp. Form.C8H13NO7P2
Mol. Mass.297.1388
SMILESOC(CCc1cccnc1)(P(O)(O)=O)P(O)(O)=O