Reaction Details
TargetFarnesyl pyrophosphate synthase
LigandBDBM50226002
Substrate/Competitorn/a
Meas. Tech.ChEMBL_466620 (CHEMBL924794)
IC50 254000±n/a nM
Citation Dunford, JEKwaasi, AARogers, MJBarnett, BLEbetino, FHRussell, RGOppermann, UKavanagh, KL Structure-activity relationships among the nitrogen containing bisphosphonates in clinical use and other analogues: time-dependent inhibition of human farnesyl pyrophosphate synthase. J Med Chem51:2187-95 (2008) 
 
Farnesyl pyrophosphate synthase
Name:Farnesyl pyrophosphate synthase
Type:Enzyme
Mol. Mass.:48272.89
Organism:Homo sapiens (Human)
Description:P14324
Residue:419
BDBM50226002
NameBDBM50226002
Synonyms:(R)-2-hydroxy-2-phosphono-3-(pyridin-3-yl)propanoic acid 3-(3-Pyridyl)-2-hydroxy-2-phosphonopropanoic acid | CHEMBL397829
TypeSmall organic molecule
Emp. Form.C8H10NO6P
Mol. Mass.247.1419
SMILESOC(=O)C(O)(Cc1cccnc1)P(O)(O)=O