Reaction Details
TargetFarnesyl pyrophosphate synthase
LigandBDBM50373091
Substrate/Competitorn/a
Meas. Tech.ChEMBL_466619 (CHEMBL924793)
IC50>10000000±n/a nM
Citation Dunford, JEKwaasi, AARogers, MJBarnett, BLEbetino, FHRussell, RGOppermann, UKavanagh, KL Structure-activity relationships among the nitrogen containing bisphosphonates in clinical use and other analogues: time-dependent inhibition of human farnesyl pyrophosphate synthase. J Med Chem51:2187-95 (2008) 
 
Farnesyl pyrophosphate synthase
Name:Farnesyl pyrophosphate synthase
Type:Enzyme
Mol. Mass.:48272.89
Organism:Homo sapiens (Human)
Description:P14324
Residue:419
BDBM50373091
NameBDBM50373091
Synonyms:CHEMBL260340
TypeSmall organic molecule
Emp. Form.C9H16N2O4P2
Mol. Mass.278.1819
SMILESCc1cccnc1NC(P(C)(O)=O)P(C)(O)=O