Reaction Details
TargetFarnesyl pyrophosphate synthase
LigandBDBM50115115
Substrate/Competitorn/a
Meas. Tech.ChEMBL_466620 (CHEMBL924794)
Ki 10±n/a nM
Citation Dunford, JEKwaasi, AARogers, MJBarnett, BLEbetino, FHRussell, RGOppermann, UKavanagh, KL Structure-activity relationships among the nitrogen containing bisphosphonates in clinical use and other analogues: time-dependent inhibition of human farnesyl pyrophosphate synthase. J Med Chem51:2187-95 (2008) 
 
Farnesyl pyrophosphate synthase
Name:Farnesyl pyrophosphate synthase
Type:Enzyme
Mol. Mass.:48272.89
Organism:Homo sapiens (Human)
Description:P14324
Residue:419
BDBM50115115
NameBDBM50115115
Synonyms:(Cyclohexylamino-phosphono-methyl)-phosphonic acid CHEMBL56253 | [(cyclohexylamino)methylene]-1,1-bisphosphonate
TypeSmall organic molecule
Emp. Form.C7H17NO6P2
Mol. Mass.273.1605
SMILESOP(O)(O)C(=NC1CCCCC1)P(O)(O)=O