Reaction Details
TargetAdenosylhomocysteinase
LigandBDBM50088426
Substrate/Competitorn/a
Meas. Tech.ChEMBL_466721 (CHEMBL937442)
IC50 57000±n/a nM
Citation Ando, TIwata, MZulfiqar, FMiyamoto, TNakanishi, MKitade, Y Synthesis of 2-modified aristeromycins and their analogs as potent inhibitors against Plasmodium falciparum S-adenosyl-L-homocysteine hydrolase. Bioorg Med Chem16:3809-15 (2008) 
 
Adenosylhomocysteinase
Name:Adenosylhomocysteinase
Type:PROTEIN
Mol. Mass.:53833.80
Organism:Plasmodium falciparum 3D7
Description:ChEMBL_196715
Residue:479
BDBM50088426
NameBDBM50088426
Synonyms:(1R,2S,3R,5R)-3-(6-amino-9H-purin-9-yl)-5-(hydroxymethyl)cyclopentane-1,2-diol CHEMBL49935
TypeSmall organic molecule
Emp. Form.C11H15N5O3
Mol. Mass.265.2685
SMILESNc1ncnc2n(cnc12)[C@@H]1C[C@H](CO)[C@@H](O)[C@H]1O