Reaction Details
TargetPantothenate synthetase
LigandBDBM50373136
Substrate/Competitorn/a
Meas. Tech.ChEMBL_466900 (CHEMBL935788)
IC50 140±n/a nM
Citation Velaparthi, SBrunsteiner, MUddin, RWan, BFranzblau, SGPetukhov, PA 5-tert-butyl-N-pyrazol-4-yl-4,5,6,7-tetrahydrobenzo[d]isoxazole-3-carboxamide derivatives as novel potent inhibitors of Mycobacterium tuberculosis pantothenate synthetase: initiating a quest for new antitubercular drugs. J Med Chem51:1999-2002 (2008) 
 
Pantothenate synthetase
Name:Pantothenate synthetase
Type:n/a
Mol. Mass.:32675.10
Organism:Mycobacterium tuberculosis (strain ATCC 25618 / H37Rv)
Description:ChEMBL_102878
Residue:309
BDBM50373136
NameBDBM50373136
Synonyms:CHEMBL438202
TypeSmall organic molecule
Emp. Form.C31H35N5O3
Mol. Mass.525.6413
SMILESCC(C)(C)C1CCc2onc(C(=O)Nc3cnn(Cc4ccc(cc4)C(=O)NCCc4ccccc4)c3)c2C1