Reaction Details
TargetPantothenate synthetase
LigandBDBM50373143
Substrate/Competitorn/a
Meas. Tech.ChEMBL_466900 (CHEMBL935788)
IC50 160±n/a nM
Citation Velaparthi, SBrunsteiner, MUddin, RWan, BFranzblau, SGPetukhov, PA 5-tert-butyl-N-pyrazol-4-yl-4,5,6,7-tetrahydrobenzo[d]isoxazole-3-carboxamide derivatives as novel potent inhibitors of Mycobacterium tuberculosis pantothenate synthetase: initiating a quest for new antitubercular drugs. J Med Chem51:1999-2002 (2008) 
 
Pantothenate synthetase
Name:Pantothenate synthetase
Type:n/a
Mol. Mass.:32675.10
Organism:Mycobacterium tuberculosis (strain ATCC 25618 / H37Rv)
Description:ChEMBL_102878
Residue:309
BDBM50373143
NameBDBM50373143
Synonyms:CHEMBL260779
TypeSmall organic molecule
Emp. Form.C22H25IN4O2
Mol. Mass.504.364
SMILESCC(C)(C)C1CCc2onc(C(=O)Nc3cnn(Cc4ccccc4I)c3)c2C1