Reaction Details
TargetcAMP and cAMP-inhibited cGMP 3',5'-cyclic phosphodiesterase 10A
LigandBDBM14743
Substrate/Competitorn/a
Meas. Tech.ChEMBL_466942 (CHEMBL933707)
Ki 198±n/a nM
Citation Kulkarni, SSPatel, MRTalele, TT CoMFA and HQSAR studies on 6,7-dimethoxy-4-pyrrolidylquinazoline derivatives as phosphodiesterase10A inhibitors. Bioorg Med Chem16:3675-86 (2008) 
 
cAMP and cAMP-inhibited cGMP 3',5'-cyclic phosphodiesterase 10A
Name:cAMP and cAMP-inhibited cGMP 3',5'-cyclic phosphodiesterase 10A
Type:Protein
Mol. Mass.:88412.52
Organism:Homo sapiens (Human)
Description:Q9Y233
Residue:779
BDBM14743
NameBDBM14743
Synonyms:(R)-4-[3-(2-Chloro-phenoxy)-pyrrolidin-1-yl]-6,7-dimethoxy-quinazoline 6,7-Dimethoxy-4-pyrrolidylquinazoline 6
TypeSmall organic molecule
Emp. Form.C20H20ClN3O3
Mol. Mass.385.844
SMILESCOc1cc2ncnc(N3CC[C@H](C3)Oc3ccccc3Cl)c2cc1OC