Reaction Details
TargetcGMP-inhibited 3',5'-cyclic phosphodiesterase 3A
LigandBDBM14768
Substrate/Competitorn/a
Meas. Tech.ChEMBL_466943 (CHEMBL933708)
Ki 211±n/a nM
Citation Kulkarni, SSPatel, MRTalele, TT CoMFA and HQSAR studies on 6,7-dimethoxy-4-pyrrolidylquinazoline derivatives as phosphodiesterase10A inhibitors. Bioorg Med Chem16:3675-86 (2008) 
 
cGMP-inhibited 3',5'-cyclic phosphodiesterase 3A
Name:cGMP-inhibited 3',5'-cyclic phosphodiesterase 3A
Type:Enzyme
Mol. Mass.:124966.46
Organism:Homo sapiens (Human)
Description:Q14432
Residue:1141
BDBM14768
NameBDBM14768
Synonyms:(R)-6,7-Dimethoxy-4-[3-(quinoxalin-2-yloxy)-pyrrolidin-1-yl]-quinazoline 6,7-dimethoxy-4-[(3R)-3-(quinoxalin-2-yloxy)pyrrolidin-1-yl]quinazoline
TypeSmall organic molecule
Emp. Form.C22H21N5O3
Mol. Mass.403.4338
SMILESCOc1cc2ncnc(N3CC[C@H](C3)Oc3cnc4ccccc4n3)c2cc1OC