Reaction Details
TargetcGMP-inhibited 3',5'-cyclic phosphodiesterase 3A
LigandBDBM14767
Substrate/Competitorn/a
Meas. Tech.ChEMBL_466943 (CHEMBL933708)
Ki 151±n/a nM
Citation Kulkarni, SSPatel, MRTalele, TT CoMFA and HQSAR studies on 6,7-dimethoxy-4-pyrrolidylquinazoline derivatives as phosphodiesterase10A inhibitors. Bioorg Med Chem16:3675-86 (2008) 
 
cGMP-inhibited 3',5'-cyclic phosphodiesterase 3A
Name:cGMP-inhibited 3',5'-cyclic phosphodiesterase 3A
Type:Enzyme
Mol. Mass.:124966.46
Organism:Homo sapiens (Human)
Description:Q14432
Residue:1141
BDBM14767
NameBDBM14767
Synonyms:(R)-4-[3-(Isoquinolin-3-yloxy)-pyrrolidin-1-yl]-6,7-dimethoxy-quinazoline 6,7-Dimethoxy-4-pyrrolidylquinazoline 28
TypeSmall organic molecule
Emp. Form.C23H22N4O3
Mol. Mass.402.4458
SMILESCOc1cc2ncnc(N3CC[C@H](C3)Oc3cc4ccccc4cn3)c2cc1OC