Reaction Details
TargetcGMP-inhibited 3',5'-cyclic phosphodiesterase 3A
LigandBDBM14748
Substrate/Competitorn/a
Meas. Tech.ChEMBL_466943 (CHEMBL933708)
Ki 161±n/a nM
Citation Kulkarni, SSPatel, MRTalele, TT CoMFA and HQSAR studies on 6,7-dimethoxy-4-pyrrolidylquinazoline derivatives as phosphodiesterase10A inhibitors. Bioorg Med Chem16:3675-86 (2008) 
 
cGMP-inhibited 3',5'-cyclic phosphodiesterase 3A
Name:cGMP-inhibited 3',5'-cyclic phosphodiesterase 3A
Type:Enzyme
Mol. Mass.:124966.46
Organism:Homo sapiens (Human)
Description:Q14432
Residue:1141
BDBM14748
NameBDBM14748
Synonyms:(R)-4-[3-(4-Ethoxy-phenoxy)-pyrrolidin-1-yl]-6,7-dimethoxy-quinazoline 6,7-Dimethoxy-4-pyrrolidylquinazoline 11
TypeSmall organic molecule
Emp. Form.C22H25N3O4
Mol. Mass.395.4516
SMILESCCOc1ccc(O[C@@H]2CCN(C2)c2ncnc3cc(OC)c(OC)cc23)cc1