Reaction Details
TargetGeranylgeranyl pyrophosphate synthase
LigandBDBM25270
Substrate/Competitorn/a
Meas. Tech.ChEMBL_467320 (CHEMBL939915)
IC50 200±n/a nM
Citation Wiemer, AJYu, JSShull, LWBarney, RJWasko, BMLamb, KMHohl, RJWiemer, DF Pivaloyloxymethyl-modified isoprenoid bisphosphonates display enhanced inhibition of cellular geranylgeranylation. Bioorg Med Chem16:3652-60 (2008) 
 
Geranylgeranyl pyrophosphate synthase
Name:Geranylgeranyl pyrophosphate synthase
Type:Homooctamer; transferase
Mol. Mass.:34867.94
Organism:Homo sapiens (Human)
Description:Recombinant human GGPPS was cloned and expressed in E. coli.
Residue:300
BDBM25270
NameBDBM25270
Synonyms:[(6E,11E)-2,6,12,16-tetramethyl-9-phosphonoheptadeca-2,6,11,15-tetraen-9-yl]phosphonic acid | bisphosphonate, 5
TypeSmall organic molecule
Emp. Form.C21H38O6P2
Mol. Mass.448.4703
SMILES[#6]\[#6](-[#6])=[#6]\[#6]-[#6]\[#6](-[#6])=[#6]\[#6]C([#6]\[#6]=[#6](/[#6])-[#6]-[#6]\[#6]=[#6](\[#6])-[#6])(P([#8])([#8])=O)P([#8])([#8])=O