Reaction Details
TargetMitogen-activated protein kinase 8
LigandBDBM50373213
Substrate/Competitorn/a
Meas. Tech.ChEMBL_467337 (CHEMBL939932)
IC50 190±n/a nM
Citation Asano, YKitamura, SOhra, TAso, KIgata, HTamura, TKawamoto, TTanaka, TSogabe, SMatsumoto, SYamaguchi, MKimura, HItoh, F Discovery, synthesis and biological evaluation of isoquinolones as novel and highly selective JNK inhibitors (1). Bioorg Med Chem16:4715-32 (2008) 
 
Mitogen-activated protein kinase 8
Name:Mitogen-activated protein kinase 8
Type:Enzyme
Mol. Mass.:48297.57
Organism:Homo sapiens (Human)
Description:JNK-1 was purchased from Upstate Cell Signaling Solutions (formerly Upstate Biotechnology).
Residue:427
BDBM50373213
NameBDBM50373213
Synonyms:CHEMBL409429
TypeSmall organic molecule
Emp. Form.C26H22BrNO3
Mol. Mass.476.362
SMILESCOC(=O)c1c(-c2ccccc2)c2cc(Br)ccc2c(=O)n1CCCc1ccccc1